Reaction Details
TargetBreakpoint cluster region protein/Tyrosine-protein kinase ABL1
LigandBDBM50432861
Substrate/Competitorn/a
Meas. Tech.ChEMBL_956489 (CHEMBL2379863)
IC50 4.1±n/a nM
Citation Cui, JFu, RZhou, LHChen, SPLi, GWQian, SXLiu, S BCR-ABL tyrosine kinase inhibitor pharmacophore model derived from a series of phenylaminopyrimidine-based (PAP) derivatives. Bioorg Med Chem Lett23:2442-50 (2013) 
 
Breakpoint cluster region protein/Tyrosine-protein kinase ABL1
Name:Breakpoint cluster region protein/Tyrosine-protein kinase ABL1
Type:Enzyme
Mol. Mass.:n/a
Description:n/a
Components:This complex has 2 components.
Component 1
Name:Tyrosine-protein kinase ABL1
Synonyms:ABL ABL1_HUMAN JTK7 Proto-oncogene tyrosine-protein kinase ABL1 Tyrosine-protein kinase ABL V-abl Abelson murine leukemia viral oncogene homolog 1 p150 | tyrosine-protein kinase ABL1 isoform a
Type:Enzyme
Mol. Mass.:122897.30
Organism:Homo sapiens (Human)
Description:P00519
Residue:1130
Component 2
Name:Breakpoint cluster region protein
Synonyms:BCR BCR_HUMAN Breakpoint cluster region protein | D22S11
Type:PROTEIN
Mol. Mass.:142824.75
Organism:Homo sapiens (Human)
Description:ChEMBL_305348
Residue:1271
BDBM50432861
NameBDBM50432861
Synonyms:CHEMBL2376496
TypeSmall organic molecule
Emp. Form.C27H30N6O2S
Mol. Mass.502.631
SMILESCN1CCN(CC1)c1ccc(cc1)C(=O)Nc1[nH]nc2sc(cc12)C(=O)NC(C)(C)c1ccccc1