Reaction Details
TargetTransient receptor potential cation channel subfamily A member 1
LigandBDBM26736
Substrate/Competitorn/a
Meas. Tech.ChEMBL_956684 (CHEMBL2379081)
IC50 49400±n/a nM
Citation Ortar, GMorera, EDe Petrocellis, LLigresti, ASchiano Moriello, AMorera, LNalli, MRagno, RPirolli, ADi Marzo, V Biaryl tetrazolyl ureas as inhibitors of endocannabinoid metabolism: modulation at the N-portion and distal phenyl ring. Eur J Med Chem63:118-32 (2013) 
 
Transient receptor potential cation channel subfamily A member 1
Name:Transient receptor potential cation channel subfamily A member 1
Type:PROTEIN
Mol. Mass.:128622.74
Organism:Rattus norvegicus
Description:ChEMBL_1450487
Residue:1125
BDBM26736
NameBDBM26736
Synonyms:CHEMBL509860 N,N-dimethyl-5-[(4-phenylphenyl)methyl]-1H-1,2,3,4-tetrazole-1-carboxamide
TypeSmall organic molecule
Emp. Form.C17H17N5O
Mol. Mass.307.3498
SMILESCN(C)C(=O)n1nnnc1Cc1ccc(cc1)-c1ccccc1