Reaction Details
TargetExtracellular calcium-sensing receptor
LigandBDBM50432963
Substrate/Competitorn/a
Meas. Tech.ChEMBL_957699 (CHEMBL2378664)
EC50 80±n/a nM
Citation Deprez, PTemal, TJary, HAuberval, MLively, SGuédin, DVevert, JP New potent calcimimetics: II. Discovery of benzothiazole trisubstituted ureas. Bioorg Med Chem Lett23:2455-9 (2013) 
 
Extracellular calcium-sensing receptor
Name:Extracellular calcium-sensing receptor
Type:Protein
Mol. Mass.:120663.13
Organism:Homo sapiens (Human)
Description:P41180
Residue:1078
BDBM50432963
NameBDBM50432963
Synonyms:CHEMBL2377752
TypeSmall organic molecule
Emp. Form.C30H34N4O4S2
Mol. Mass.578.745
SMILESCS(=O)(=O)c1ccc2nc(NC(=O)N(CCC(c3ccccc3)c3ccccc3)CCN3CCOCC3)sc2c1