Reaction Details
TargetExtracellular calcium-sensing receptor
LigandBDBM50432978
Substrate/Competitorn/a
Meas. Tech.ChEMBL_957699 (CHEMBL2378664)
EC50 300±n/a nM
Citation Deprez, PTemal, TJary, HAuberval, MLively, SGuédin, DVevert, JP New potent calcimimetics: II. Discovery of benzothiazole trisubstituted ureas. Bioorg Med Chem Lett23:2455-9 (2013) 
 
Extracellular calcium-sensing receptor
Name:Extracellular calcium-sensing receptor
Type:Protein
Mol. Mass.:120663.13
Organism:Homo sapiens (Human)
Description:P41180
Residue:1078
BDBM50432978
NameBDBM50432978
Synonyms:CHEMBL2377738
TypeSmall organic molecule
Emp. Form.C36H39N5O2
Mol. Mass.573.7272
SMILESO=C(Nc1nc2ccccc2n1Cc1ccccc1)N(CCC(c1ccccc1)c1ccccc1)CCN1CCOCC1