Reaction Details
TargetSerine/threonine-protein kinase mTOR
LigandBDBM50433046
Substrate/Competitorn/a
Meas. Tech.ChEMBL_955789 (CHEMBL2379606)
Ki 7.8±n/a nM
Citation Cheng, HHoffman, JELe, PTPairish, MKania, RFarrell, WBagrodia, SYuan, JSun, SZhang, EXiang, CDalvie, DRahavendran, SV Structure-based design, SAR analysis and antitumor activity of PI3K/mTOR dual inhibitors from 4-methylpyridopyrimidinone series. Bioorg Med Chem Lett23:2787-92 (2013) 
 
Serine/threonine-protein kinase mTOR
Name:Serine/threonine-protein kinase mTOR
Type:Rapamycin target protein
Mol. Mass.:288917.12
Organism:Homo sapiens (Human)
Description:P42345
Residue:2549
BDBM50433046
NameBDBM50433046
Synonyms:CHEMBL2375965
TypeSmall organic molecule
Emp. Form.C24H25N5O3
Mol. Mass.431.487
SMILESCc1nc(N)nc2n([C@H]3CC[C@@H](CC3)OCO)c(=O)c(cc12)-c1cnc2ccccc2c1