Reaction Details
TargetPhosphatidylinositol 4,5-bisphosphate 3-kinase catalytic subunit alpha isoform
LigandBDBM50433048
Substrate/Competitorn/a
Meas. Tech.ChEMBL_955790 (CHEMBL2379607)
Ki 3.4±n/a nM
Citation Cheng, HHoffman, JELe, PTPairish, MKania, RFarrell, WBagrodia, SYuan, JSun, SZhang, EXiang, CDalvie, DRahavendran, SV Structure-based design, SAR analysis and antitumor activity of PI3K/mTOR dual inhibitors from 4-methylpyridopyrimidinone series. Bioorg Med Chem Lett23:2787-92 (2013) 
 
Phosphatidylinositol 4,5-bisphosphate 3-kinase catalytic subunit alpha isoform
Name:Phosphatidylinositol 4,5-bisphosphate 3-kinase catalytic subunit alpha isoform
Type:Protein
Mol. Mass.:124421.84
Organism:Mus musculus (Mouse)
Description:P42337
Residue:1068
BDBM50433048
NameBDBM50433048
Synonyms:CHEMBL2375967
TypeSmall organic molecule
Emp. Form.C18H22N6O3
Mol. Mass.370.4057
SMILESCc1nc(N)nc2n([C@H]3CC[C@@H](CC3)OCO)c(=O)c(cc12)-c1cn[nH]c1