Reaction Details
TargetPhosphatidylinositol 4,5-bisphosphate 3-kinase catalytic subunit alpha isoform
LigandBDBM50433049
Substrate/Competitorn/a
Meas. Tech.ChEMBL_955790 (CHEMBL2379607)
Ki 1.000000±n/a nM
Citation Cheng, HHoffman, JELe, PTPairish, MKania, RFarrell, WBagrodia, SYuan, JSun, SZhang, EXiang, CDalvie, DRahavendran, SV Structure-based design, SAR analysis and antitumor activity of PI3K/mTOR dual inhibitors from 4-methylpyridopyrimidinone series. Bioorg Med Chem Lett23:2787-92 (2013) 
 
Phosphatidylinositol 4,5-bisphosphate 3-kinase catalytic subunit alpha isoform
Name:Phosphatidylinositol 4,5-bisphosphate 3-kinase catalytic subunit alpha isoform
Type:Protein
Mol. Mass.:124421.84
Organism:Mus musculus (Mouse)
Description:P42337
Residue:1068
BDBM50433049
NameBDBM50433049
Synonyms:CHEMBL2375365
TypeSmall organic molecule
Emp. Form.C20H24N6O4
Mol. Mass.412.4424
SMILESCOc1ncc(cn1)-c1cc2c(C)nc(N)nc2n([C@H]2CC[C@@H](CC2)OCO)c1=O