Reaction Details
TargetCarbonic anhydrase
LigandBDBM50428615
Substrate/Competitorn/a
Meas. Tech.ChEMBL_955915 (CHEMBL2379884)
Ki 134±n/a nM
Citation Vullo, DLeewattanapasuk, WMühlschlegel, FAMastrolorenzo, ACapasso, CSupuran, CT Carbonic anhydrase inhibitors: inhibition of the฿-class enzyme from the pathogenic yeast Candida glabrata with sulfonamides, sulfamates and sulfamides. Bioorg Med Chem Lett23:2647-52 (2013) 
 
Carbonic anhydrase
Name:Carbonic anhydrase
Type:Enzyme
Mol. Mass.:31587.59
Organism:Candida albicans (Yeast)
Description:n/a
Residue:281
BDBM50428615
NameBDBM50428615
Synonyms:CHEMBL2331759
TypeSmall organic molecule
Emp. Form.C13H20N4O3S
Mol. Mass.312.388
SMILESNS(=O)(=O)Nc1ccc(NC(=O)NC2CCCCC2)cc1