Reaction Details
TargetCarbonic anhydrase
LigandBDBM50428618
Substrate/Competitorn/a
Meas. Tech.ChEMBL_955915 (CHEMBL2379884)
Ki 58±n/a nM
Citation Vullo, DLeewattanapasuk, WMühlschlegel, FAMastrolorenzo, ACapasso, CSupuran, CT Carbonic anhydrase inhibitors: inhibition of the฿-class enzyme from the pathogenic yeast Candida glabrata with sulfonamides, sulfamates and sulfamides. Bioorg Med Chem Lett23:2647-52 (2013) 
 
Carbonic anhydrase
Name:Carbonic anhydrase
Type:Enzyme
Mol. Mass.:31587.59
Organism:Candida albicans (Yeast)
Description:n/a
Residue:281
BDBM50428618
NameBDBM50428618
Synonyms:CHEMBL2331756
TypeSmall organic molecule
Emp. Form.C12H14N4O4S
Mol. Mass.310.329
SMILESNS(=O)(=O)Nc1ccc(NC(=O)NCc2ccco2)cc1