Reaction Details
TargetCarbonic anhydrase
LigandBDBM50428619
Substrate/Competitorn/a
Meas. Tech.ChEMBL_955915 (CHEMBL2379884)
Ki 55±n/a nM
Citation Vullo, DLeewattanapasuk, WMühlschlegel, FAMastrolorenzo, ACapasso, CSupuran, CT Carbonic anhydrase inhibitors: inhibition of the฿-class enzyme from the pathogenic yeast Candida glabrata with sulfonamides, sulfamates and sulfamides. Bioorg Med Chem Lett23:2647-52 (2013) 
 
Carbonic anhydrase
Name:Carbonic anhydrase
Type:Enzyme
Mol. Mass.:31587.59
Organism:Candida albicans (Yeast)
Description:n/a
Residue:281
BDBM50428619
NameBDBM50428619
Synonyms:CHEMBL2331755
TypeSmall organic molecule
Emp. Form.C16H20N4O3S
Mol. Mass.348.42
SMILESCC(C)c1ccccc1NC(=O)Nc1ccc(NS(N)(=O)=O)cc1