Reaction Details
TargetCarbonic anhydrase
LigandBDBM50387134
Substrate/Competitorn/a
Meas. Tech.ChEMBL_955915 (CHEMBL2379884)
Ki 84±n/a nM
Citation Vullo, DLeewattanapasuk, WMühlschlegel, FAMastrolorenzo, ACapasso, CSupuran, CT Carbonic anhydrase inhibitors: inhibition of the฿-class enzyme from the pathogenic yeast Candida glabrata with sulfonamides, sulfamates and sulfamides. Bioorg Med Chem Lett23:2647-52 (2013) 
 
Carbonic anhydrase
Name:Carbonic anhydrase
Type:Enzyme
Mol. Mass.:31587.59
Organism:Candida albicans (Yeast)
Description:n/a
Residue:281
BDBM50387134
NameBDBM50387134
Synonyms:4-ureidophenyl sulfamate ring derivative 3s | CHEMBL2047814
TypeSmall organic molecule
Emp. Form.C13H10BrF2N3O4S
Mol. Mass.422.202
SMILESNS(=O)(=O)Oc1ccc(NC(=O)Nc2c(F)cc(F)cc2Br)cc1