Reaction Details
TargetInterleukin-5
LigandBDBM50433120
Substrate/Competitorn/a
Meas. Tech.ChEMBL_956594 (CHEMBL2380080)
IC50 9000±n/a nM
Citation Venkateswararao, ESharma, VKLee, KCRoh, EKim, YJung, SH Design and synthesis of novel chromenone derivatives as interleukin-5 inhibitors. Bioorg Med Chem21:2543-50 (2013) 
 
Interleukin-5
Name:Interleukin-5
Type:PROTEIN
Mol. Mass.:15414.97
Organism:Mus musculus
Description:ChEMBL_1464308
Residue:133
BDBM50433120
NameBDBM50433120
Synonyms:CHEMBL2377409
TypeSmall organic molecule
Emp. Form.C25H27ClO4
Mol. Mass.426.932
SMILESOC(CCc1coc2cccc(OCC3CCCCC3)c2c1=O)c1ccc(Cl)cc1