Reaction Details
TargetInterleukin-5
LigandBDBM50433122
Substrate/Competitorn/a
Meas. Tech.ChEMBL_956594 (CHEMBL2380080)
IC50 6500±n/a nM
Citation Venkateswararao, ESharma, VKLee, KCRoh, EKim, YJung, SH Design and synthesis of novel chromenone derivatives as interleukin-5 inhibitors. Bioorg Med Chem21:2543-50 (2013) 
 
Interleukin-5
Name:Interleukin-5
Type:PROTEIN
Mol. Mass.:15414.97
Organism:Mus musculus
Description:ChEMBL_1464308
Residue:133
BDBM50433122
NameBDBM50433122
Synonyms:CHEMBL2377406
TypeSmall organic molecule
Emp. Form.C26H30O5
Mol. Mass.422.5134
SMILESCOc1ccc(cc1)C(O)CCc1coc2cccc(OCC3CCCCC3)c2c1=O