Reaction Details
TargetLong-chain fatty acid transport protein 1
LigandBDBM50433140
Substrate/Competitorn/a
Meas. Tech.ChEMBL_956919 (CHEMBL2378195)
IC50 600±n/a nM
Citation Matsufuji, TIkeda, MNaito, AHirouchi, MKanda, SIzumi, MHarada, JShinozuka, T Arylpiperazines as fatty acid transport protein 1 (FATP1) inhibitors with improved potency and pharmacokinetic properties. Bioorg Med Chem Lett23:2560-5 (2013) 
 
Long-chain fatty acid transport protein 1
Name:Long-chain fatty acid transport protein 1
Type:PROTEIN
Mol. Mass.:71289.41
Organism:Mus musculus
Description:ChEMBL_956919
Residue:646
BDBM50433140
NameBDBM50433140
Synonyms:CHEMBL2377621
TypeSmall organic molecule
Emp. Form.C18H22FN5OS
Mol. Mass.375.464
SMILESFc1ccc(nc1)N1CCN(CC(=O)Nc2nc3CCCCc3s2)CC1