Reaction Details
TargetLong-chain fatty acid transport protein 1
LigandBDBM50433156
Substrate/Competitorn/a
Meas. Tech.ChEMBL_956920 (CHEMBL2378196)
IC50 430±n/a nM
Citation Matsufuji, TIkeda, MNaito, AHirouchi, MKanda, SIzumi, MHarada, JShinozuka, T Arylpiperazines as fatty acid transport protein 1 (FATP1) inhibitors with improved potency and pharmacokinetic properties. Bioorg Med Chem Lett23:2560-5 (2013) 
 
Long-chain fatty acid transport protein 1
Name:Long-chain fatty acid transport protein 1
Type:PROTEIN
Mol. Mass.:71123.97
Organism:Homo sapiens (Human)
Description:ChEMBL_956920
Residue:646
BDBM50433156
NameBDBM50433156
Synonyms:CHEMBL2377767
TypeSmall organic molecule
Emp. Form.C17H21FN4OS
Mol. Mass.348.438
SMILESCc1nc(NC(=O)CN2CCN(CC2)c2ccc(F)cc2)sc1C