Reaction Details
TargetTyrosine-protein phosphatase non-receptor type 1
LigandBDBM50433188
Substrate/Competitorn/a
Meas. Tech.ChEMBL_956927 (CHEMBL2378244)
Ki 18±n/a nM
Citation Chandrasekharappa, APBadiger, SEDubey, PKPanigrahi, SKManukonda, SR Design and synthesis of 2-substituted benzoxazoles as novel PTP1B inhibitors. Bioorg Med Chem Lett23:2579-84 (2013) 
 
Tyrosine-protein phosphatase non-receptor type 1
Name:Tyrosine-protein phosphatase non-receptor type 1
Type:Protein phosphatase
Mol. Mass.:49963.76
Organism:Homo sapiens (Human)
Description:Human recombinant GST-fusion PTP1B (1-435).
Residue:435
BDBM50433188
NameBDBM50433188
Synonyms:CHEMBL2377808
TypeSmall organic molecule
Emp. Form.C33H35N3O11
Mol. Mass.649.6445
SMILESCCc1cc(CN(C(C)=O)C(=O)NCCCCOc2cccc(O)c2C(=O)OC)ccc1N(C(=O)C(O)=O)c1ccccc1C(O)=O