Reaction Details
TargetJAK3/JAK1
LigandBDBM50433254
Substrate/Competitorn/a
Meas. Tech.ChEMBL_957627 (CHEMBL2378510)
IC50 100±n/a nM
Citation Lynch, SMDeVicente, JHermann, JCJaime-Figueroa, SJin, SKuglstatter, ALi, HLovey, AMenke, JNiu, LPatel, VRoy, DSoth, MSteiner, STivitmahaisoon, PVu, MDYee, C Strategic use of conformational bias and structure based design to identify potent JAK3 inhibitors with improved selectivity against the JAK family and the kinome. Bioorg Med Chem Lett23:2793-800 (2013) 
 
JAK3/JAK1
Name:JAK3/JAK1
Synonyms:Tyrosine-protein kinase JAK1/JAK3
Type:n/a
Mol. Mass.:n/a
Description:ASSAY_ID of ChEMBL is 2193386
Components:This complex has 2 components.
Component 1
Name:Tyrosine-protein kinase JAK3
Type:Protein
Mol. Mass.:125111.08
Organism:Homo sapiens (Human)
Description:P52333
Residue:1124
Component 2
Name:Tyrosine-protein kinase JAK1
Synonyms:JAK-1 JAK1A JAK1_HUMAN Janus kinase 1 (JAK1) | Janus kinase 1 JAK1
Type:Protein
Mol. Mass.:133293.73
Organism:Homo sapiens (Human)
Description:P23458
Residue:1154
BDBM50433254
NameBDBM50433254
Synonyms:CHEMBL2376040
TypeSmall organic molecule
Emp. Form.C23H24N6O5
Mol. Mass.464.4739
SMILESCOc1cc(cc(OC)c1OC)-c1cnc2[nH]cc(C(=O)N[C@H](C)C(=O)N3CC(C3)C#N)c2n1