Reaction Details
TargetBeta-1,4-mannosyl-glycoprotein 4-beta-N-acetylglucosaminyltransferase
LigandBDBM50433274
Substrate/Competitorn/a
Meas. Tech.ChEMBL_957854 (CHEMBL2378967)
IC50 126±n/a nM
Citation Barlind, JGBuckett, LKCrosby, SGDavidsson, ÖEmtenäs, HErtan, AJurva, ULemurell, MGutierrez, PMNilsson, KO'Mahony, GPetersson, AURedzic, AWågberg, FYuan, ZQ Identification and design of a novel series of MGAT2 inhibitors. Bioorg Med Chem Lett23:2721-6 (2013) 
 
Beta-1,4-mannosyl-glycoprotein 4-beta-N-acetylglucosaminyltransferase
Name:Beta-1,4-mannosyl-glycoprotein 4-beta-N-acetylglucosaminyltransferase
Type:PROTEIN
Mol. Mass.:61324.81
Organism:Homo sapiens (Human)
Description:ChEMBL_107586
Residue:533
BDBM50433274
NameBDBM50433274
Synonyms:CHEMBL2376321
TypeSmall organic molecule
Emp. Form.C19H19F2N3O5S
Mol. Mass.439.433
SMILESCC[C@]1(C)NC(=O)c2cc(ccc2NC1=O)S(=O)(=O)Nc1ccc(OC(F)F)cc1