Reaction Details
TargetBeta-1,4-mannosyl-glycoprotein 4-beta-N-acetylglucosaminyltransferase
LigandBDBM50433269
Substrate/Competitorn/a
Meas. Tech.ChEMBL_957854 (CHEMBL2378967)
IC50 50±n/a nM
Citation Barlind, JGBuckett, LKCrosby, SGDavidsson, ÖEmtenäs, HErtan, AJurva, ULemurell, MGutierrez, PMNilsson, KO'Mahony, GPetersson, AURedzic, AWågberg, FYuan, ZQ Identification and design of a novel series of MGAT2 inhibitors. Bioorg Med Chem Lett23:2721-6 (2013) 
 
Beta-1,4-mannosyl-glycoprotein 4-beta-N-acetylglucosaminyltransferase
Name:Beta-1,4-mannosyl-glycoprotein 4-beta-N-acetylglucosaminyltransferase
Type:PROTEIN
Mol. Mass.:61324.81
Organism:Homo sapiens (Human)
Description:ChEMBL_107586
Residue:533
BDBM50433269
NameBDBM50433269
Synonyms:CHEMBL2376303
TypeSmall organic molecule
Emp. Form.C18H17F2N3O4S
Mol. Mass.409.407
SMILESCC[C@]1(C)NC(=O)c2cc(ccc2NC1=O)S(=O)(=O)Nc1ccc(F)cc1F