Reaction Details
TargetAlpha-1,3-mannosyl-glycoprotein 2-beta-N-acetylglucosaminyltransferase
LigandBDBM50433270
Substrate/Competitorn/a
Meas. Tech.ChEMBL_957855 (CHEMBL2378968)
IC50 32±n/a nM
Citation Barlind, JGBuckett, LKCrosby, SGDavidsson, ÖEmtenäs, HErtan, AJurva, ULemurell, MGutierrez, PMNilsson, KO'Mahony, GPetersson, AURedzic, AWågberg, FYuan, ZQ Identification and design of a novel series of MGAT2 inhibitors. Bioorg Med Chem Lett23:2721-6 (2013) 
 
Alpha-1,3-mannosyl-glycoprotein 2-beta-N-acetylglucosaminyltransferase
Name:Alpha-1,3-mannosyl-glycoprotein 2-beta-N-acetylglucosaminyltransferase
Type:PROTEIN
Mol. Mass.:50891.32
Organism:Homo sapiens (Human)
Description:ChEMBL_107587
Residue:445
BDBM50433270
NameBDBM50433270
Synonyms:CHEMBL2376329
TypeSmall organic molecule
Emp. Form.C19H21N3O5S
Mol. Mass.403.452
SMILESCCC1(C)NC(=O)c2cc(ccc2NC1=O)S(=O)(=O)Nc1ccc(OC)cc1