Reaction Details
TargetAlpha-1,6-mannosyl-glycoprotein 2-beta-N-acetylglucosaminyltransferase
LigandBDBM50433270
Substrate/Competitorn/a
Meas. Tech.ChEMBL_957856 (CHEMBL2378969)
IC50 40±n/a nM
Citation Barlind, JGBuckett, LKCrosby, SGDavidsson, ÖEmtenäs, HErtan, AJurva, ULemurell, MGutierrez, PMNilsson, KO'Mahony, GPetersson, AURedzic, AWågberg, FYuan, ZQ Identification and design of a novel series of MGAT2 inhibitors. Bioorg Med Chem Lett23:2721-6 (2013) 
 
Alpha-1,6-mannosyl-glycoprotein 2-beta-N-acetylglucosaminyltransferase
Name:Alpha-1,6-mannosyl-glycoprotein 2-beta-N-acetylglucosaminyltransferase
Type:PROTEIN
Mol. Mass.:51045.37
Organism:Mus musculus
Description:ChEMBL_107583
Residue:442
BDBM50433270
NameBDBM50433270
Synonyms:CHEMBL2376329
TypeSmall organic molecule
Emp. Form.C19H21N3O5S
Mol. Mass.403.452
SMILESCCC1(C)NC(=O)c2cc(ccc2NC1=O)S(=O)(=O)Nc1ccc(OC)cc1