Reaction Details
TargetAlpha-1,6-mannosyl-glycoprotein 2-beta-N-acetylglucosaminyltransferase
LigandBDBM50433276
Substrate/Competitorn/a
Meas. Tech.ChEMBL_957858 (CHEMBL2378971)
IC50 1.6±n/a nM
Citation Barlind, JGBuckett, LKCrosby, SGDavidsson, ÖEmtenäs, HErtan, AJurva, ULemurell, MGutierrez, PMNilsson, KO'Mahony, GPetersson, AURedzic, AWågberg, FYuan, ZQ Identification and design of a novel series of MGAT2 inhibitors. Bioorg Med Chem Lett23:2721-6 (2013) 
 
Alpha-1,6-mannosyl-glycoprotein 2-beta-N-acetylglucosaminyltransferase
Name:Alpha-1,6-mannosyl-glycoprotein 2-beta-N-acetylglucosaminyltransferase
Type:n/a
Mol. Mass.:51567.80
Organism:Homo sapiens (Human)
Description:Q10469
Residue:447
BDBM50433276
NameBDBM50433276
Synonyms:CHEMBL2376316
TypeSmall organic molecule
Emp. Form.C19H21F2N3O3S
Mol. Mass.409.45
SMILESCCC1(CC)CNc2ccc(cc2C(=O)N1)S(=O)(=O)Nc1ccc(F)cc1F