Reaction Details
TargetAlpha-1,6-mannosyl-glycoprotein 2-beta-N-acetylglucosaminyltransferase
LigandBDBM50433269
Substrate/Competitorn/a
Meas. Tech.ChEMBL_957769 (CHEMBL2378802)
IC50 79±n/a nM
Citation Barlind, JGBuckett, LKCrosby, SGDavidsson, ÖEmtenäs, HErtan, AJurva, ULemurell, MGutierrez, PMNilsson, KO'Mahony, GPetersson, AURedzic, AWågberg, FYuan, ZQ Identification and design of a novel series of MGAT2 inhibitors. Bioorg Med Chem Lett23:2721-6 (2013) 
 
Alpha-1,6-mannosyl-glycoprotein 2-beta-N-acetylglucosaminyltransferase
Name:Alpha-1,6-mannosyl-glycoprotein 2-beta-N-acetylglucosaminyltransferase
Type:PROTEIN
Mol. Mass.:51045.37
Organism:Mus musculus
Description:ChEMBL_107583
Residue:442
BDBM50433269
NameBDBM50433269
Synonyms:CHEMBL2376303
TypeSmall organic molecule
Emp. Form.C18H17F2N3O4S
Mol. Mass.409.407
SMILESCC[C@]1(C)NC(=O)c2cc(ccc2NC1=O)S(=O)(=O)Nc1ccc(F)cc1F