Reaction Details
TargetAcyl-CoA wax alcohol acyltransferase 2
LigandBDBM50433274
Substrate/Competitorn/a
Meas. Tech.ChEMBL_957771 (CHEMBL2378804)
IC50>100000±n/a nM
Citation Barlind, JGBuckett, LKCrosby, SGDavidsson, ÖEmtenäs, HErtan, AJurva, ULemurell, MGutierrez, PMNilsson, KO'Mahony, GPetersson, AURedzic, AWågberg, FYuan, ZQ Identification and design of a novel series of MGAT2 inhibitors. Bioorg Med Chem Lett23:2721-6 (2013) 
 
Acyl-CoA wax alcohol acyltransferase 2
Name:Acyl-CoA wax alcohol acyltransferase 2
Type:PROTEIN
Mol. Mass.:38111.73
Organism:Homo sapiens (Human)
Description:ChEMBL_107584
Residue:333
BDBM50433274
NameBDBM50433274
Synonyms:CHEMBL2376321
TypeSmall organic molecule
Emp. Form.C19H19F2N3O5S
Mol. Mass.439.433
SMILESCC[C@]1(C)NC(=O)c2cc(ccc2NC1=O)S(=O)(=O)Nc1ccc(OC(F)F)cc1