Reaction Details
TargetAlpha-1,6-mannosyl-glycoprotein 2-beta-N-acetylglucosaminyltransferase
LigandBDBM50433269
Substrate/Competitorn/a
Meas. Tech.ChEMBL_957858 (CHEMBL2378971)
IC50 6.3±n/a nM
Citation Barlind, JGBuckett, LKCrosby, SGDavidsson, ÖEmtenäs, HErtan, AJurva, ULemurell, MGutierrez, PMNilsson, KO'Mahony, GPetersson, AURedzic, AWågberg, FYuan, ZQ Identification and design of a novel series of MGAT2 inhibitors. Bioorg Med Chem Lett23:2721-6 (2013) 
 
Alpha-1,6-mannosyl-glycoprotein 2-beta-N-acetylglucosaminyltransferase
Name:Alpha-1,6-mannosyl-glycoprotein 2-beta-N-acetylglucosaminyltransferase
Type:n/a
Mol. Mass.:51567.80
Organism:Homo sapiens (Human)
Description:Q10469
Residue:447
BDBM50433269
NameBDBM50433269
Synonyms:CHEMBL2376303
TypeSmall organic molecule
Emp. Form.C18H17F2N3O4S
Mol. Mass.409.407
SMILESCC[C@]1(C)NC(=O)c2cc(ccc2NC1=O)S(=O)(=O)Nc1ccc(F)cc1F