Reaction Details
TargetCholinesterase
LigandBDBM50433313
Substrate/Competitorn/a
Meas. Tech.ChEMBL_957894 (CHEMBL2377919)
IC50 2.5±n/a nM
Citation Chen, YSun, JHuang, ZLiao, HPeng, SLehmann, JZhang, Y Design, synthesis and evaluation of tacrine-flurbiprofen-nitrate trihybrids as novel anti-Alzheimer's disease agents. Bioorg Med Chem21:2462-70 (2013) 
 
Cholinesterase
Name:Cholinesterase
Type:Enzyme
Mol. Mass.:65643.35
Organism:Equus caballus (Horse)
Description:P81908
Residue:574
BDBM50433313
NameBDBM50433313
Synonyms:CHEMBL2376474
TypeSmall organic molecule
Emp. Form.C36H41FN4O5
Mol. Mass.628.7329
SMILESCC(C(=O)NCCCCCCNc1c2CCCCc2nc2ccccc12)c1ccc(c(F)c1)-c1ccc(OCCO[N+]([O-])=O)cc1