Reaction Details
TargetHistamine H1 receptor
LigandBDBM50433357
Substrate/Competitorn/a
Meas. Tech.ChEMBL_955845 (CHEMBL2379702)
Ki 33884±n/a nM
Citation Andaloussi, MLim, HDvan der Meer, TSijm, MPoulie, CBde Esch, IJLeurs, RSmits, RA A novel series of histamine H4 receptor antagonists based on the pyrido[3,2-d]pyrimidine scaffold: comparison of hERG binding and target residence time with PF-3893787. Bioorg Med Chem Lett23:2663-70 (2013) 
 
Histamine H1 receptor
Name:Histamine H1 receptor
Type:G Protein-Coupled Receptor (GPCR)
Mol. Mass.:55808.72
Organism:Homo sapiens (Human)
Description:Cell pellets from SK-N-MC cells transfected with human H1 receptor were used in binding assay.
Residue:487
BDBM50433357
NameBDBM50433357
Synonyms:CHEMBL2376800
TypeSmall organic molecule
Emp. Form.C13H18N6
Mol. Mass.258.3222
SMILESCCc1cnc2c(nc(N)nc2c1)N1CC(C1)NC