Reaction Details
TargetHistamine H4 receptor
LigandBDBM50433356
Substrate/Competitorn/a
Meas. Tech.ChEMBL_955841 (CHEMBL2379698)
Ki 138±n/a nM
Citation Andaloussi, MLim, HDvan der Meer, TSijm, MPoulie, CBde Esch, IJLeurs, RSmits, RA A novel series of histamine H4 receptor antagonists based on the pyrido[3,2-d]pyrimidine scaffold: comparison of hERG binding and target residence time with PF-3893787. Bioorg Med Chem Lett23:2663-70 (2013) 
 
Histamine H4 receptor
Name:Histamine H4 receptor
Type:G Protein-Coupled Receptor (GPCR)
Mol. Mass.:44045.07
Organism:Rattus norvegicus (rat)
Description:Cell pellets from SK-N-MC cells transfected with rat H4 receptor were used in binding assay.
Residue:391
BDBM50433356
NameBDBM50433356
Synonyms:CHEMBL2376801
TypeSmall organic molecule
Emp. Form.C14H20N6
Mol. Mass.272.3488
SMILESCCc1cnc2c(nc(N)nc2c1)N1CC[C@H](C1)NC