Reaction Details
TargetCycloartenol synthase
LigandBDBM50433360
Substrate/Competitorn/a
Meas. Tech.ChEMBL_956102 (CHEMBL2379127)
IC50 200±n/a nM
Citation Lange, SKeller, MMüller, COliaro-Bosso, SBalliano, GBracher, F Aminopropylindenes derived from Grundmann's ketone as a novel chemotype of oxidosqualene cyclase inhibitors. Eur J Med Chem63:758-64 (2013) 
 
Cycloartenol synthase
Name:Cycloartenol synthase
Type:PROTEIN
Mol. Mass.:86025.20
Organism:Arabidopsis thaliana
Description:ChEMBL_956102
Residue:759
BDBM50433360
NameBDBM50433360
Synonyms:CHEMBL2375380
TypeSmall organic molecule
Emp. Form.C26H42N
Mol. Mass.368.6178
SMILESCC(C)CCC[C@@H](C)[C@H]1CCC2=C(CCC[n+]3ccccc3)CCC[C@]12C