Reaction Details
TargetCycloartenol synthase
LigandBDBM50433362
Substrate/Competitorn/a
Meas. Tech.ChEMBL_956102 (CHEMBL2379127)
IC50 300±n/a nM
Citation Lange, SKeller, MMüller, COliaro-Bosso, SBalliano, GBracher, F Aminopropylindenes derived from Grundmann's ketone as a novel chemotype of oxidosqualene cyclase inhibitors. Eur J Med Chem63:758-64 (2013) 
 
Cycloartenol synthase
Name:Cycloartenol synthase
Type:PROTEIN
Mol. Mass.:86025.20
Organism:Arabidopsis thaliana
Description:ChEMBL_956102
Residue:759
BDBM50433362
NameBDBM50433362
Synonyms:CHEMBL2377451
TypeSmall organic molecule
Emp. Form.C23H43N
Mol. Mass.333.5942
SMILESCC(C)CCC[C@@H](C)[C@H]1CCC2=C(CCCN(C)C)CCC[C@]12C