Reaction Details
TargetCyclin-dependent kinase 3/G1/S-specific cyclin-E1
LigandBDBM50433369
Substrate/Competitorn/a
Meas. Tech.ChEMBL_956654 (CHEMBL2380181)
IC50 38±n/a nM
Citation Schonbrunn, EBetzi, SAlam, RMartin, MPBecker, AHan, HFrancis, RChakrasali, RJakkaraj, SKazi, ASebti, SMCubitt, CLGebhard, AWHazlehurst, LATash, JSGeorg, GI Development of highly potent and selective diaminothiazole inhibitors of cyclin-dependent kinases. J Med Chem56:3768-82 (2013) 
 
Cyclin-dependent kinase 3/G1/S-specific cyclin-E1
Name:Cyclin-dependent kinase 3/G1/S-specific cyclin-E1
Type:Protein
Mol. Mass.:n/a
Description:n/a
Components:This complex has 2 components.
Component 1
Name:Cyclin-dependent kinase 3
Synonyms:CDK3 CDK3_HUMAN Cyclin-dependent kinase 3 | Cyclin-dependent kinase 3 (CDK3)
Type:Enzyme
Mol. Mass.:35053.88
Organism:Homo sapiens (Human)
Description:Q00526
Residue:305
Component 2
Name:G1/S-specific cyclin-E1
Synonyms:CCNE CCNE1_HUMAN
Type:Enzyme Subunit
Mol. Mass.:47073.17
Organism:Homo sapiens (Human)
Description:n/a
Residue:410
BDBM50433369
NameBDBM50433369
Synonyms:CHEMBL2377825
TypeSmall organic molecule
Emp. Form.C16H13N5O5S2
Mol. Mass.419.435
SMILESNc1nc(Nc2ccc(cc2)S(N)(=O)=O)sc1C(=O)c1ccccc1[N+]([O-])=O