Reaction Details
TargetCyclin-A2/Cyclin-dependent kinase 1
LigandBDBM50433369
Substrate/Competitorn/a
Meas. Tech.ChEMBL_956657 (CHEMBL2380184)
IC50 7.6±n/a nM
Citation Schonbrunn, EBetzi, SAlam, RMartin, MPBecker, AHan, HFrancis, RChakrasali, RJakkaraj, SKazi, ASebti, SMCubitt, CLGebhard, AWHazlehurst, LATash, JSGeorg, GI Development of highly potent and selective diaminothiazole inhibitors of cyclin-dependent kinases. J Med Chem56:3768-82 (2013) 
 
Cyclin-A2/Cyclin-dependent kinase 1
Name:Cyclin-A2/Cyclin-dependent kinase 1
Type:Protein Complex
Mol. Mass.:n/a
Description:CDK1 was expressed in a baculovirus expression system and was partially purified. Cyclin A was purified separately and mixed with CDK1 before assays.
Components:This complex has 2 components.
Component 1
Name:Cyclin-dependent kinase 1
Synonyms:CDC2 CDK1 CDKN1 Cell division protein kinase 1 P34CDC2 | p34 protein kinase
Type:Enzyme Subunit
Mol. Mass.:34101.08
Organism:Homo sapiens (Human)
Description:P06493
Residue:297
Component 2
Name:Cyclin-A2
Synonyms:CCN1 CCNA1 CCNA2_HUMAN Cyclin-A
Type:Enzyme Subunit
Mol. Mass.:48550.19
Organism:Homo sapiens (Human)
Description:P20248
Residue:432
BDBM50433369
NameBDBM50433369
Synonyms:CHEMBL2377825
TypeSmall organic molecule
Emp. Form.C16H13N5O5S2
Mol. Mass.419.435
SMILESNc1nc(Nc2ccc(cc2)S(N)(=O)=O)sc1C(=O)c1ccccc1[N+]([O-])=O