Reaction Details
TargetMethionine aminopeptidase 2
LigandBDBM47468
Substrate/Competitorn/a
Meas. Tech.ChEMBL_957169 (CHEMBL2378707)
EC50>100000±n/a nM
Citation Zhang, FBhat, SGabelli, SBChen, XMiller, MSNacev, BACheng, YLMeyers, DJTenney, KShim, JSCrews, PAmzel, LMMa, DLiu, JO Pyridinylquinazolines selectively inhibit human methionine aminopeptidase-1 in cells. J Med Chem56:3996-4016 (2013) 
 
Methionine aminopeptidase 2
Name:Methionine aminopeptidase 2
Type:Enzyme
Mol. Mass.:52884.45
Organism:Homo sapiens (Human)
Description:P50579
Residue:478
BDBM47468
NameBDBM47468
Synonyms:MLS000769840 N-(2-phenylethyl)-2-pyridin-2-yl-quinazolin-4-amine Phenethyl-(2-pyridin-2-yl-quinazolin-4-yl)-amine cid_937982 | phenethyl-[2-(2-pyridyl)quinazolin-4-yl]amine
TypeSmall organic molecule
Emp. Form.C21H18N4
Mol. Mass.326.3944
SMILESC(Cc1ccccc1)Nc1nc(nc2ccccc12)-c1ccccn1