Reaction Details
TargetMethionine aminopeptidase 2
LigandBDBM50433398
Substrate/Competitorn/a
Meas. Tech.ChEMBL_957169 (CHEMBL2378707)
EC50>100000±n/a nM
Citation Zhang, FBhat, SGabelli, SBChen, XMiller, MSNacev, BACheng, YLMeyers, DJTenney, KShim, JSCrews, PAmzel, LMMa, DLiu, JO Pyridinylquinazolines selectively inhibit human methionine aminopeptidase-1 in cells. J Med Chem56:3996-4016 (2013) 
 
Methionine aminopeptidase 2
Name:Methionine aminopeptidase 2
Type:Enzyme
Mol. Mass.:52884.45
Organism:Homo sapiens (Human)
Description:P50579
Residue:478
BDBM50433398
NameBDBM50433398
Synonyms:CHEMBL2375607
TypeSmall organic molecule
Emp. Form.C24H20Cl2N4
Mol. Mass.435.348
SMILESClc1ccc(cc1Cl)N1CCN(CC1)c1cc(nc2ccccc12)-c1ccccn1