Reaction Details
TargetLipoprotein lipase
LigandBDBM50433472
Substrate/Competitorn/a
Meas. Tech.ChEMBL_959456 (CHEMBL2384494)
IC50 1690±n/a nM
Citation Greco, MNConnelly, MALeo, GCOlson, MWPowell, EHuang, ZHawkins, MSmith, CSchalk-Hihi, CDarrow, ALXin, HLang, WDamiano, BPHlasta, DJ A thiocarbamate inhibitor of endothelial lipase raises HDL cholesterol levels in mice. Bioorg Med Chem Lett23:2595-7 (2013) 
 
Lipoprotein lipase
Name:Lipoprotein lipase
Type:PROTEIN
Mol. Mass.:53173.96
Organism:Homo sapiens (Human)
Description:ChEMBL_1280894
Residue:475
BDBM50433472
NameBDBM50433472
Synonyms:CHEMBL2381069
TypeSmall organic molecule
Emp. Form.C20H24FNOS
Mol. Mass.345.474
SMILESFc1ccccc1CSC(=O)NCCCCCCc1ccccc1