Reaction Details
TargetEndothelial lipase
LigandBDBM50433473
Substrate/Competitorn/a
Meas. Tech.ChEMBL_959272 (CHEMBL2383839)
IC50 23±n/a nM
Citation Greco, MNConnelly, MALeo, GCOlson, MWPowell, EHuang, ZHawkins, MSmith, CSchalk-Hihi, CDarrow, ALXin, HLang, WDamiano, BPHlasta, DJ A thiocarbamate inhibitor of endothelial lipase raises HDL cholesterol levels in mice. Bioorg Med Chem Lett23:2595-7 (2013) 
 
Endothelial lipase
Name:Endothelial lipase
Type:Protein
Mol. Mass.:56805.62
Organism:Homo sapiens (Human)
Description:Q9Y5X9
Residue:500
BDBM50433473
NameBDBM50433473
Synonyms:CHEMBL2381070
TypeSmall organic molecule
Emp. Form.C21H21F2N3O3S
Mol. Mass.433.472
SMILESFc1cc(F)cc(OCCCCCNC(=O)SCc2nnc(o2)-c2ccccc2)c1