Reaction Details
TargetMitogen-activated protein kinase 1
LigandBDBM50433476
Substrate/Competitorn/a
Meas. Tech.ChEMBL_959520 (CHEMBL2384687)
IC50 20000±n/a nM
Citation Huang, XCheng, CCFischmann, TODuca, JSRichards, MTadikonda, PKReddy, PAZhao, LSiddiqui, MAParry, DDavis, NSeghezzi, WWiswell, DShipps, GW Structure-based design and optimization of 2-aminothiazole-4-carboxamide as a new class of CHK1 inhibitors. Bioorg Med Chem Lett23:2590-4 (2013) 
 
Mitogen-activated protein kinase 1
Name:Mitogen-activated protein kinase 1
Type:Ser/Thr Protein Kinase
Mol. Mass.:41392.76
Organism:Homo sapiens (Human)
Description:P28482
Residue:360
BDBM50433476
NameBDBM50433476
Synonyms:CHEMBL2381116
TypeSmall organic molecule
Emp. Form.C22H22N6O3S
Mol. Mass.450.513
SMILESCOc1ccc2CN(C(=O)c2c1)c1nc(cs1)C(=O)Nc1cnccc1N1CCNCC1