Reaction Details
TargetSerine/threonine-protein kinase Chk1
LigandBDBM50433476
Substrate/Competitorn/a
Meas. Tech.ChEMBL_959524 (CHEMBL2384691)
IC50 3.7±n/a nM
Citation Huang, XCheng, CCFischmann, TODuca, JSRichards, MTadikonda, PKReddy, PAZhao, LSiddiqui, MAParry, DDavis, NSeghezzi, WWiswell, DShipps, GW Structure-based design and optimization of 2-aminothiazole-4-carboxamide as a new class of CHK1 inhibitors. Bioorg Med Chem Lett23:2590-4 (2013) 
 
Serine/threonine-protein kinase Chk1
Name:Serine/threonine-protein kinase Chk1
Type:Enzyme Catalytic Domain
Mol. Mass.:54443.02
Organism:Homo sapiens (Human)
Description:gi_166295192
Residue:476
BDBM50433476
NameBDBM50433476
Synonyms:CHEMBL2381116
TypeSmall organic molecule
Emp. Form.C22H22N6O3S
Mol. Mass.450.513
SMILESCOc1ccc2CN(C(=O)c2c1)c1nc(cs1)C(=O)Nc1cnccc1N1CCNCC1