Reaction Details
TargetSerine/threonine-protein kinase Chk1
LigandBDBM50433486
Substrate/Competitorn/a
Meas. Tech.ChEMBL_959662 (CHEMBL2382855)
EC50 3750±n/a nM
Citation Huang, XCheng, CCFischmann, TODuca, JSRichards, MTadikonda, PKReddy, PAZhao, LSiddiqui, MAParry, DDavis, NSeghezzi, WWiswell, DShipps, GW Structure-based design and optimization of 2-aminothiazole-4-carboxamide as a new class of CHK1 inhibitors. Bioorg Med Chem Lett23:2590-4 (2013) 
 
Serine/threonine-protein kinase Chk1
Name:Serine/threonine-protein kinase Chk1
Type:Enzyme Catalytic Domain
Mol. Mass.:54443.02
Organism:Homo sapiens (Human)
Description:gi_166295192
Residue:476
BDBM50433486
NameBDBM50433486
Synonyms:CHEMBL2381102
TypeSmall organic molecule
Emp. Form.C24H25N7O2S
Mol. Mass.475.566
SMILESCOc1ccc(cc1)-c1cc(Nc2nc(cs2)C(=O)Nc2ccccc2N2CCNCC2)[nH]n1