Reaction Details
TargetSerine/threonine-protein kinase Chk1
LigandBDBM50433488
Substrate/Competitorn/a
Meas. Tech.ChEMBL_959662 (CHEMBL2382855)
EC50 350±n/a nM
Citation Huang, XCheng, CCFischmann, TODuca, JSRichards, MTadikonda, PKReddy, PAZhao, LSiddiqui, MAParry, DDavis, NSeghezzi, WWiswell, DShipps, GW Structure-based design and optimization of 2-aminothiazole-4-carboxamide as a new class of CHK1 inhibitors. Bioorg Med Chem Lett23:2590-4 (2013) 
 
Serine/threonine-protein kinase Chk1
Name:Serine/threonine-protein kinase Chk1
Type:Enzyme Catalytic Domain
Mol. Mass.:54443.02
Organism:Homo sapiens (Human)
Description:gi_166295192
Residue:476
BDBM50433488
NameBDBM50433488
Synonyms:CHEMBL2381249
TypeSmall organic molecule
Emp. Form.C21H21N7OS
Mol. Mass.419.503
SMILESO=C(Nc1ccccc1N1CCNCC1)c1csc(Nc2n[nH]c3ccccc23)n1