Reaction Details
TargetSerine/threonine-protein kinase Chk1
LigandBDBM50433491
Substrate/Competitorn/a
Meas. Tech.ChEMBL_959662 (CHEMBL2382855)
EC50 1400±n/a nM
Citation Huang, XCheng, CCFischmann, TODuca, JSRichards, MTadikonda, PKReddy, PAZhao, LSiddiqui, MAParry, DDavis, NSeghezzi, WWiswell, DShipps, GW Structure-based design and optimization of 2-aminothiazole-4-carboxamide as a new class of CHK1 inhibitors. Bioorg Med Chem Lett23:2590-4 (2013) 
 
Serine/threonine-protein kinase Chk1
Name:Serine/threonine-protein kinase Chk1
Type:Enzyme Catalytic Domain
Mol. Mass.:54443.02
Organism:Homo sapiens (Human)
Description:gi_166295192
Residue:476
BDBM50433491
NameBDBM50433491
Synonyms:CHEMBL2381238
TypeSmall organic molecule
Emp. Form.C22H23N5OS
Mol. Mass.405.516
SMILESO=C(Nc1ccccc1N1CCNCC1)c1csc(n1)N1Cc2ccccc2C1