Reaction Details
TargetSerine/threonine-protein kinase Chk1
LigandBDBM50433508
Substrate/Competitorn/a
Meas. Tech.ChEMBL_959664 (CHEMBL2382857)
IC50 5700±n/a nM
Citation Huang, XCheng, CCFischmann, TODuca, JSRichards, MTadikonda, PKReddy, PAZhao, LSiddiqui, MAParry, DDavis, NSeghezzi, WWiswell, DShipps, GW Structure-based design and optimization of 2-aminothiazole-4-carboxamide as a new class of CHK1 inhibitors. Bioorg Med Chem Lett23:2590-4 (2013) 
 
Serine/threonine-protein kinase Chk1
Name:Serine/threonine-protein kinase Chk1
Type:Enzyme Catalytic Domain
Mol. Mass.:54443.02
Organism:Homo sapiens (Human)
Description:gi_166295192
Residue:476
BDBM50433508
NameBDBM50433508
Synonyms:CHEMBL2381241
TypeSmall organic molecule
Emp. Form.C21H23N7OS
Mol. Mass.421.519
SMILESCc1ncc2CN(Cc2n1)c1nc(cs1)C(=O)Nc1ccccc1N1CCNCC1