Reaction Details
TargetPhosphatidylinositol 4,5-bisphosphate 3-kinase catalytic subunit gamma isoform
LigandBDBM50433536
Substrate/Competitorn/a
Meas. Tech.ChEMBL_959696 (CHEMBL2383016)
Ki 0.550000±n/a nM
Citation Staben, STNdubaku, CBlaquiere, NBelvin, MBull, RJDudley, DEdgar, KGray, DHeald, RHeffron, TPJones, GEJones, MKolesnikov, ALee, LLesnick, JLewis, CMurray, JMcLean, NJNonomiya, JOlivero, AGOrd, RPang, JPrice, SPrior, WWRouge, LSalphati, LSampath, DWallin, JWang, LWei, BWeismann, CWu, P Discovery of thiazolobenzoxepin PI3-kinase inhibitors that spare the PI3-kinaseß isoform. Bioorg Med Chem Lett23:2606-13 (2013) 
 
Phosphatidylinositol 4,5-bisphosphate 3-kinase catalytic subunit gamma isoform
Name:Phosphatidylinositol 4,5-bisphosphate 3-kinase catalytic subunit gamma isoform
Type:Enzyme Subunit
Mol. Mass.:126470.30
Organism:Homo sapiens (Human)
Description:P48736
Residue:1102
BDBM50433536
NameBDBM50433536
Synonyms:CHEMBL2381373
TypeSmall organic molecule
Emp. Form.C21H22N6O2S
Mol. Mass.422.503
SMILESCC(C)n1ncnc1-c1nc-2c(CCOc3cc(ccc-23)-c2cnn(CCO)c2)s1