Reaction Details
TargetE3 ubiquitin-protein ligase Mdm2
LigandBDBM50111440
Substrate/Competitorn/a
Meas. Tech.ChEMBL_959852 (CHEMBL2383516)
IC50 5.0±n/a nM
Citation Carry, JCGarcia-Echeverria, C Inhibitors of the p53/hdm2 protein-protein interaction-path to the clinic. Bioorg Med Chem Lett23:2480-5 (2013) 
 
E3 ubiquitin-protein ligase Mdm2
Name:E3 ubiquitin-protein ligase Mdm2
Type:Oncoprotein
Mol. Mass.:55196.54
Organism:Homo sapiens (Human)
Description:Q00987
Residue:491
BDBM50111440
NameBDBM50111440
Synonyms:4-(1-carbamoyl-4-methylpentanamide-2-yl-cyclopropylcarbamoyl)-4-{2-(6-chloro-1H-3-indolyl)-1-[1-{1-methyl-1-[1-(1-methylcarboxamido-2-phenylethylcarboxamido)-3-methylsulfanylpropylcarboxamido]ethylcarboxamido}-2-(4-methylphosphatephenyl)ethylcarboxamido]ethylcarboxamido}butanoic acid CID44286587
TypeSmall organic molecule
Emp. Form.C56H72ClN10O14PS
Mol. Mass.1207.722
SMILESCSCC[C@H](NC(=O)[C@H](Cc1ccccc1)NC(C)=O)C(=O)NC(C)(C)C(=O)N[C@@H](Cc1ccc(CP([O-])([O-])=O)cc1)C(=O)N[C@@H](Cc1c[nH]c2cc(Cl)ccc12)C(=O)N[C@@H](CCC(O)=O)C(=O)NC1(CC1)C(=O)N[C@@H](CC(C)C)C(N)=O