Reaction Details
TargetNeuronal acetylcholine receptor subunit alpha-4/beta-2
LigandBDBM50241748
Substrate/Competitorn/a
Meas. Tech.ChEMBL_959893 (CHEMBL2383619)
IC50 20±n/a nM
Citation Faundez-Parraguez, MFarias-Rabelo, NGonzalez-Gutierrez, JPEtcheverry-Berrios, AAlzate-Morales, JAdasme-Carreño, FVaras, RBermudez, IIturriaga-Vasquez, P Neonicotinic analogues: selective antagonists fora4ß2 nicotinic acetylcholine receptors. Bioorg Med Chem21:2687-94 (2013) 
 
Neuronal acetylcholine receptor subunit alpha-4/beta-2
Name:Neuronal acetylcholine receptor subunit alpha-4/beta-2
Type:Protein
Mol. Mass.:n/a
Description:n/a
Components:This complex has 2 components.
Component 1
Name:Neuronal acetylcholine receptor subunit alpha-4
Synonyms:ACHA4_HUMAN CHRNA4 protein Neuronal acetylcholine receptor protein alpha-4 subunit Nicotinic acetylcholine receptor alpha4/beta2/alpha5
Type:n/a
Mol. Mass.:69963.49
Organism:Homo sapiens (Human)
Description:NACHRA4
Residue:627
Component 2
Name:Neuronal acetylcholine receptor subunit beta-2
Synonyms:ACHB2_HUMAN Neuronal acetylcholine receptor protein beta-2 subunit | Nicotinic acetylcholine receptor alpha3/beta2/alpha5
Type:Protein
Mol. Mass.:57020.50
Organism:Homo sapiens (Human)
Description:P17787
Residue:502
BDBM50241748
NameBDBM50241748
Synonyms:CHEMBL518059 | dihydro-beta-erythroidine
TypeSmall organic molecule
Emp. Form.C16H21NO3
Mol. Mass.275.3428
SMILESCO[C@H]1CC=C2CCN3CCC4=C(CC(=O)OC4)[C@@]23C1