Reaction Details
TargetMuscarinic acetylcholine receptor M5
LigandBDBM50258656
Substrate/Competitorn/a
Meas. Tech.ChEMBL_960029 (CHEMBL2384199)
EC50 0.263000±n/a nM
Citation Gentry, PRBridges, TMLamsal, AVinson, PNSmith, EChase, PHodder, PSEngers, JLNiswender, CMDaniels, JSJeffrey Conn, PWood, MRLindsley, CW Discovery of ML326: The first sub-micromolar, selective M5 PAM. Bioorg Med Chem Lett23:2996-3000 (2013) 
 
Muscarinic acetylcholine receptor M5
Name:Muscarinic acetylcholine receptor M5
Type:Enzyme Catalytic Domain
Mol. Mass.:60161.80
Organism:RAT
Description:Cholinergic, muscarinic M5 CHRM5 RAT::P08911
Residue:531
BDBM50258656
NameBDBM50258656
Synonyms:1-(4-methoxybenzyl)-5-(trifluoromethoxy)indoline-2,3-dione VU0238429 | cid_42633508
TypeSmall organic molecule
Emp. Form.C17H12F3NO4
Mol. Mass.351.2767
SMILESCOc1ccc(CN2C(=O)C(=O)c3cc(OC(F)(F)F)ccc23)cc1