Reaction Details
TargetGlucagon receptor
LigandBDBM50433576
Substrate/Competitorn/a
Meas. Tech.ChEMBL_960258 (CHEMBL2382751)
Ki 1600±n/a nM
Citation Guzman-Perez, APfefferkorn, JALee, ECStevens, BDAspnes, GEBian, JDidiuk, MTFilipski, KJMoore, DPerreault, CSammons, MFTu, MBrown, JAtkinson, KLitchfield, JTan, BSamas, BZavadoski, WJSalatto, CTTreadway, J The design and synthesis of a potent glucagon receptor antagonist with favorable physicochemical and pharmacokinetic properties as a candidate for the treatment of type 2 diabetes mellitus. Bioorg Med Chem Lett23:3051-8 (2013) 
 
Glucagon receptor
Name:Glucagon receptor
Type:Enzyme
Mol. Mass.:54026.92
Organism:Homo sapiens (Human)
Description:P47871
Residue:477
BDBM50433576
NameBDBM50433576
Synonyms:CHEMBL2381849
TypeSmall organic molecule
Emp. Form.C26H28F3N3O4
Mol. Mass.503.5134
SMILESCCC[C@@H](Oc1cc(C)c(c(C)c1)-n1cc(cn1)C(F)(F)F)c1ccc(cc1)C(=O)NCCC(O)=O