Reaction Details
TargetGlucagon receptor
LigandBDBM100817
Substrate/Competitorn/a
Meas. Tech.ChEMBL_960258 (CHEMBL2382751)
Ki 290±n/a nM
Citation Guzman-Perez, APfefferkorn, JALee, ECStevens, BDAspnes, GEBian, JDidiuk, MTFilipski, KJMoore, DPerreault, CSammons, MFTu, MBrown, JAtkinson, KLitchfield, JTan, BSamas, BZavadoski, WJSalatto, CTTreadway, J The design and synthesis of a potent glucagon receptor antagonist with favorable physicochemical and pharmacokinetic properties as a candidate for the treatment of type 2 diabetes mellitus. Bioorg Med Chem Lett23:3051-8 (2013) 
 
Glucagon receptor
Name:Glucagon receptor
Type:Enzyme
Mol. Mass.:54026.92
Organism:Homo sapiens (Human)
Description:P47871
Residue:477
BDBM100817
NameBDBM100817
Synonyms:US8507533, 124
TypeSmall organic molecule
Emp. Form.C27H27N3O4
Mol. Mass.457.521
SMILESCCCC(Oc1ccc(cc1)-n1cc2ccccc2n1)c1ccc(cc1)C(=O)NCCC(O)=O