Reaction Details
TargetGlucagon receptor
LigandBDBM50433578
Substrate/Competitorn/a
Meas. Tech.ChEMBL_960258 (CHEMBL2382751)
Ki 690±n/a nM
Citation Guzman-Perez, APfefferkorn, JALee, ECStevens, BDAspnes, GEBian, JDidiuk, MTFilipski, KJMoore, DPerreault, CSammons, MFTu, MBrown, JAtkinson, KLitchfield, JTan, BSamas, BZavadoski, WJSalatto, CTTreadway, J The design and synthesis of a potent glucagon receptor antagonist with favorable physicochemical and pharmacokinetic properties as a candidate for the treatment of type 2 diabetes mellitus. Bioorg Med Chem Lett23:3051-8 (2013) 
 
Glucagon receptor
Name:Glucagon receptor
Type:Enzyme
Mol. Mass.:54026.92
Organism:Homo sapiens (Human)
Description:P47871
Residue:477
BDBM50433578
NameBDBM50433578
Synonyms:CHEMBL2381846
TypeSmall organic molecule
Emp. Form.C27H31N3O4
Mol. Mass.461.5527
SMILESCCCC(Oc1ccc(cc1)-n1cc2CCCCc2n1)c1ccc(cc1)C(=O)NCCC(O)=O