Reaction Details
TargetTyrosine-protein kinase JAK2
LigandBDBM50433607
Substrate/Competitorn/a
Meas. Tech.ChEMBL_958068 (CHEMBL2383938)
IC50 5.0±n/a nM
Citation Guan, HLamb, MLPeng, BHuang, SDegrace, NRead, JHussain, SWu, JRivard, CAlimzhanov, MBebernitz, GBell, KYe, MZinda, MIoannidis, S Discovery of novel Jak2-Stat pathway inhibitors with extended residence time on target. Bioorg Med Chem Lett23:3105-10 (2013) 
 
Tyrosine-protein kinase JAK2
Name:Tyrosine-protein kinase JAK2
Type:Protein
Mol. Mass.:130684.68
Organism:Homo sapiens (Human)
Description:O60674
Residue:1132
BDBM50433607
NameBDBM50433607
Synonyms:CHEMBL2381985
TypeSmall organic molecule
Emp. Form.C18H22FN9O
Mol. Mass.399.4254
SMILESC[C@H](Nc1cc(nc(Nc2cc(C)n[nH]2)n1)N1CCOCC1)c1ncc(F)cn1